isis-git

Clone Tools
  • last updated a few minutes ago
Constraints
Constraints: committers
 
Constraints: files
Constraints: dates
ISIS-2374 upgrade gradle to 6.5.1

    • -1
    • +1
    /gradle/wrapper/gradle-wrapper.properties
ISIS-2374 extracting bill of materials from gradle.build files into dependencies.gradle 2/2

    • -10
    • +10
    /core/internaltestsupport/build.gradle
    • -4
    • +4
    /extensions/core/flyway/impl/build.gradle
    • -1
    • +1
    /extensions/vro/cors/impl/build.gradle
  1. … 28 more files in changeset.
ISIS-2374 extracting bill of materials from gradle.build files into dependencies.gradle 1/2

    • -9
    • +9
    /core/internaltestsupport/build.gradle
    • -0
    • +49
    /dependencies.gradle
    • -1
    • +1
    /extensions/core/flyway/impl/build.gradle
    • -2
    • +2
    /legacy/extensions/core/applib/build.gradle
    • -2
    • +2
    /legacy/extensions/core/commons/build.gradle
  1. … 23 more files in changeset.
ISIS-2374 re-enabled tests, gradle-wrapper.properties added

    • -0
    • +5
    /gradle/wrapper/gradle-wrapper.properties
ISIS-2374 with jdk11

    • -0
    • +1
    /valuetypes/asciidoc/ui/vaadin/build.gradle
    • -10
    • +16
    /valuetypes/asciidoc/ui/vaadin/pom.xml
Passed up to: Task :isis-parent:isis:isis-valuetypes:isis-valuetypes-asciidoc:isis-valuetypes-asciidoc-ui:isis-valuetypes-asciidoc-ui-vaa:compileJava FAILED

Stuck at -> Task :isis-parent:isis:isis-testing:isis-testing-fakedata:isis-testing-fakedata-applib:test FAILED

  1. … 24 more files in changeset.
Stuck at -> Task :isis-parent:isis:isis-persistence-jdo:isis-persistence-jdo-datanucleus5:compileTestJava FAILED some classes moved from test to main, a class duplicated, test(s) commented out

  1. … 41 more files in changeset.
Stuck at -> Task :isis-parent:isis:isis-core-runtime:compileTestJava FAILED

Stuck at -> Task :isis-parent:isis:isis-core-metamodel:compileTestJava FAILED (Commneted out: :isis-app-starter-parent:demo-parent:demo-wicket)

Stuck at -> Task :isis-app-starter-parent:demo-parent:demo-wicket:compileJava FAILED

    • -0
    • +7
    /valuetypes/asciidoc/ui/wicket/build.gradle
Runs up to: :isis-app-starter-parent:demo-parent:demo-wicket:compileJava

    • -2
    • +10
    /extensions/security/secman/api/build.gradle
Runs up to: "Task :isis-parent:isis:isis-core-config:compileJava FAILED"

    • -0
    • +51
    /api/applib/build.gradle
    • -0
    • +39
    /api/schema/build.gradle
    • -0
    • +17
    /core/codegen-bytebuddy/build.gradle
    • -0
    • +38
    /core/commons/build.gradle
    • -0
    • +17
    /core/config/build.gradle
    • -0
    • +42
    /core/internaltestsupport/build.gradle
    • -0
    • +32
    /core/metamodel/build.gradle
    • -0
    • +17
    /core/runtime/build.gradle
    • -0
    • +16
    /core/runtimeservices/build.gradle
    • -0
    • +18
    /core/security/build.gradle
    • -0
    • +18
    /core/webapp/build.gradle
    • -0
    • +2
    /examples/demo/domain/build.gradle
  1. … 79 more files in changeset.
Merge remote-tracking branch 'origin/master'

ISIS-2342 createImage/Svg differentiated, sample for interactive SVG (not fully working though), better names, cleanup images

ISIS-2340: fx: new menu section labels

ISIS-2340: vaa: new menu section labels (also proper spacing CSS)

ISIS-2342 extensions to createImage(Field), About, ASF(c)

ISIS-2222: uses menu section titles

  1. … 13 more files in changeset.
ISIS-2400: wkt: adds menu section CSS, also adds spacers to sections

ISIS-2400: fixes MenuVisitor to also emit very first sections (when labeled)

ISIS-2400: wkt: menu item separators implemented properly (using fragments)

ISIS-2400: wkt: remove menu spacer hack

ISIS-2400: update menubar visitor (also adding call site stubs)

ISIS-2400: redirect schema location unless menubars.xsd gets released

ISIS-2400: update menubar.xsd and add example use to demo

ISIS-2222: moves the ApplicationTenancyEvaluatorForDemo class

alongside SecManVm ... asciidoc wasn't finding the file, perhaps a compile issue somehow not resolving "../" correctly?

ISIS-2222: improves the documentation for secman's application tenancy demo

ISIS-2222: fleshes out demo for application tenancy, tweaks.

ISIS-2222: fleshes out demo for application tenancy

  1. … 3 more files in changeset.